{"text_format":"1","workbook":"xlsx","n_sheets":27,"sheets":["Instrucciones","1-Datos Empresa","Datos","2-Datos Gestor y Diagnóstico","3-Datos de Proceso y Producción","4-Consumos energéticos","5-Inventario general","6-DdC","7-Mejoras de EE","7B-Sugerencias de EE","8-Resumen Ejecutivo",">> Planillas de Relevamiento ->","A-Fact Elec","A-Fact Gas","A-Fact Otros Comb","B-Invent Motores","B-Invent Bbas y ventiladores","B-Invent Iluminación","B-Equipos de Oficina","B-Aire acondicionado","B-Invent Aire Comprimido","B-Invent Calderas","B-Invent Hornos","C-Invent C. Const. Mat","C-Invent C. Const. Est. Pasiv","C-Características del entorno ","D-Caract Hoteles"],"not_rendered":{"charts":1,"images":3,"macros":1,"external_links":0,"defined_names":122,"comments":2,"pivot_tables":0},"unopened":[],"bounds":{"document_bytes":16777216,"sheet_cells":100000,"rows_first":2000,"rows_last":500,"rows_between":2000,"halvings":0,"cell_chars":16384,"cell_head_chars":4096},"cells_cut":0,"cells_raw":0,"read":"whole","date_system":"1900"}

{"sheet":"Instrucciones","index":0,"n_rows":21,"n_cols":6,"rows_kept":21,"cut":false,"hidden":false,"merged":[[16,0,19,0],[1,2,1,3],[15,2,15,3],[3,2,3,3],[4,2,4,3],[2,2,2,3],[6,0,14,0]]}
[null,null,null,null,null,"EEv2.0"]
[null,null," PROGRAMA DE EFICIENCIA ENERGÉTICA v2020"]
[null,null,"IMPORTANTE: Esta planilla DEBE ser abierta con sus macros ya que sino no funcionará correctamente. En la planilla deberán completarse únicamente las celdas de color BLANCO."]
[null,null,"Nota: Antes de iniciar un nuevo diagnóstico verifique que ésta sea la última versión de la planilla de diagnóstico. \nLa versión actualizada se encuentra cargada en el Módulo 9 del Curso de Gestores Energéticos en:"]
[null,null,"http://curso.cfi.org.ar"]
[null,null,"N°","Instrucciones de Uso (avanzar en orden para la carga del diagnóstico)"]
{"$rows_left_out":16}
{"sheet":"1-Datos Empresa","index":1,"n_rows":55,"n_cols":9,"rows_kept":55,"cut":false,"hidden":false,"merged":[[12,3,12,4],[7,3,7,4],[8,3,8,4],[53,2,53,3],[43,1,43,4],[20,3,20,4],[24,3,24,4],[15,3,15,4],[13,3,13,4],[19,1,19,2],[29,1,29,3],[21,1,21,2],[20,1,20,2],[23,3,23,4],[54,1,54,4],[38,1,38,4],[31,2,31,4],[32,2,32,4],[33,2,33,4],[42,1,42,4],[44,2,44,3],[45,2,45,3],[46,2,46,3],[52,2,52,3],[47,2,47,3],[48,2,48,3],[49,2,49,3],[50,2,50,3],[51,2,51,3],[2,7,3,7],[18,3,18,4],[17,3,17,4],[3,1,3,3],[16,1,18,1],[2,1,2,4],[4,3,4,4],[4,1,4,2],[10,3,10,4],[5,1,5,2],[6,3,6,4],[9,3,9,4],[9,1,9,2],[5,3,5,4],[14,3,14,4],[11,1,15,1],[0,1,0,4],[37,1,37,4],[11,3,11,4],[27,2,27,4],[28,2,28,4],[19,3,19,4],[21,3,21,4],[16,3,16,4],[25,3,25,4],[22,1,26,1],[26,3,26,4],[22,3,22,4],[6,1,8,2],[10,1,10,2],[34,1,34,4],[30,2,30,4]]}
[null,"OBLIGATORIO COMPLETAR FORMULARIO"]
[]
[null,"PROGRAMA DE EFICIENCIA ENERGÉTICA v2020",null,null,null,null,null,"Verifica-ción"]
[null,"Datos Generales de la Empresa",null,null,{"$f":"SUM(H5:H29)","v":0}]
[null,"Nombre de la empresa",null,null,null,null,null,{"$f":"IF(D5=\"\",0,1)","v":0}]
[null,"Tamaño de la empresa (lista desplegable) (*)",null,null,null,null,null,0]
{"$rows_left_out":50}
{"sheet":"Datos","index":2,"n_rows":641,"n_cols":36,"rows_kept":641,"cut":false,"hidden":true,"merged":[]}
[]
[null,"Categoría PyME","Buenos Aires","BuenosAires","A - AGRICULTURA, GANADERIA, CAZA Y SILVICULTURA",null,"A","AGRICULTURA, GANADERIA, CAZA Y SILVICULTURA","01 AGRICULTURA, GANADERIA, CAZA Y SERVICIOS CONEXOS",null,"01112 Cultivo de cereales forrajeros",null,{"$f":"VLOOKUP(M3,$C$2:$D$25,2,FALSE)","v":"Córdoba"},"SanJuan","Corrientes","EntreRios","Misiones","SantaFe","Chaco","Formosa","Jujuy","Salta","Tucumán","Santiago","LaRioja","Mendoza","LaPampa","Neuquén","RioNegro","Chubut","SantaCruz","TDF","BuenosAires","Catamarca","CABA","SanLuis"]
[null,"Micro","CABA","CABA","B - PESCA Y SERVICIOS CONEXOS",null,"A","AGRICULTURA, GANADERIA, CAZA Y SILVICULTURA","02 SILVICULTURA, EXTRACCION DE MADERA Y SERVICIOS CONEXOS",null,"01113 Cultivo de oleaginosas excepto el de semillas para siembra",null,"Córdoba","San Juan","Corrientes","Entre Ríos","Misiones","Santa Fe","Chaco","Formosa","Jujuy","Salta","Tucumán","Santiago del Estero","La Rioja","Mendoza","La Pampa","Neuquén","Río Negro","Chubut","Santa Cruz","Tierra del Fuego, Antártida e Islas del Atlántico Sur","Buenos Aires","Catamarca","CABA","San Luis"]
[null,"Pequeña","Catamarca",{"$f":"C4","v":"Catamarca"},"C - EXPLOTACION DE MINAS Y CANTERAS",null,"B","PESCA Y SERVICIOS CONEXOS","05 PESCA, EXPLOTACION DE CRIADEROS DE PECES, GRANJAS PISCICOLAS Y SERVICIOS CONEXOS",null,"01114 Cultivo de pastos forrajeros",null,"Calamuchita","Albardón","Bella Vista","Colón","Capital","Belgrano","San Fernando","Bermejo","Cochinoca","Anta","Burruyacu","Capital","Capital","Guaymallen","Atreuco","Confluencia","Adolfo Alsina","Atlántico","Corpen Aike","Antartida Argentina","Adolfo Alsina","Capital","Comuna 1 (Retiro, San Nicolás, Puerto Madero, San Telmo, Monserrat y Constitución)","Pueyrredón"]
[null,"Mediana tramo 1","Chaco",{"$f":"C5","v":"Chaco"},"D - INDUSTRIA MANUFACTURERA",null,"C","EXPLOTACION DE MINAS Y CANTERAS","10 EXTRACCION DE CARBON Y LIGNITO; EXTRACCION DE TURBA",null,"01121 Cultivo de papa, batata y mandioca",null,"Capital","Angaco","Berón de Astrada","Concordia","Oberá","Caseros","Comandante Fernandez","Formosa","Dr. Manuel Belgrano","Cachi","Capital","Banda ","Chilecito","Las Heras","Caleu Caleu","Zapala","Avellaneda","Biedma","Deseado","Islas del Atlantico Sur","Adolfo Gonzales Chaves","Valle Viejo","Comuna 2 (Recoleta )","Pedernera"]
[null,"Mediana tramo 2","Chubut",{"$f":"C6","v":"Chubut"},"E - ELECTRICIDAD, GAS Y AGUA",null,"C","EXPLOTACION DE MINAS Y CANTERAS","11 EXTRACCION DE PETROLEO CRUDO Y GAS NATURAL; ACTIVIDADES DE SERVICIOS RELACIONADAS CON LA EXTRACCION DE PETROLEO Y GAS, EXCEPTO LAS ACTIVIDADES DE PROSPECCION",null,"01122 Cultivo de bulbos, brotes, raíces y hortalizas de fruto",null,"Colón","Calingasta","Capital","Diamante","Iguazú","Castellanos","General Güemes","Laishi","El Carmen","Cafayate","Chicligasta","Rio Hondo","Arauco","San Rafael","Capital","Lácar","Bariloche","Cushamen","Güer Aike","Río Grande","Alberti","Belén","Comuna 3 (San Cristóbal y Balvanera)","Junín"]
{"$rows_left_out":636}
{"sheet":"2-Datos Gestor y Diagnóstico","index":3,"n_rows":24,"n_cols":9,"rows_kept":24,"cut":false,"hidden":false,"merged":[[0,1,0,4],[4,0,21,0],[4,1,4,4],[6,2,6,4],[20,2,20,4],[21,2,21,4],[13,2,13,4],[9,2,9,4],[16,2,16,4],[2,1,2,4],[3,1,3,4],[7,2,7,4],[19,2,19,4],[10,2,10,4],[4,7,5,7],[5,1,5,3],[23,1,23,4],[24,1,24,4],[18,2,18,4],[15,2,15,4],[11,2,11,4],[14,2,14,4],[17,1,17,4],[12,2,12,4],[8,2,8,4]]}
[null,"OBLIGATORIO COMPLETAR FORMULARIO"]
[]
[null,"PROGRAMA DE EFICIENCIA ENERGÉTICA v2020"]
[null,"Empresa a diagnosticar "]
[null,{"$f":"IF('1-Datos Empresa'!D5=\"\",\"\",'1-Datos Empresa'!D5)","v":""},null,null,null,null,null,"Verifica-ción"]
[null,"Gestor Energético",null,null,{"$f":"SUM(H7:H19)","v":0}]
{"$rows_left_out":19}
{"sheet":"3-Datos de Proceso y Producción","index":4,"n_rows":42,"n_cols":8,"rows_kept":42,"cut":false,"hidden":false,"merged":[[0,1,0,5],[39,4,39,5],[40,4,40,5],[14,1,14,2],[15,1,15,2],[14,4,14,5],[15,4,15,5],[16,1,16,5],[17,1,18,1],[30,2,30,3],[38,2,38,3],[40,2,40,3],[29,1,29,5],[17,2,18,2],[17,5,18,5],[39,2,39,3],[30,4,30,5],[7,1,7,2],[8,1,8,2],[7,4,7,5],[8,4,8,5],[17,3,18,3],[9,4,9,5],[10,4,10,5],[11,4,11,5],[12,4,12,5],[10,1,10,2],[11,1,11,2],[12,1,12,2],[13,1,13,2],[9,1,9,2],[13,4,13,5],[2,1,2,5],[4,1,5,2],[6,1,6,2],[4,4,5,5],[6,4,6,5],[3,1,3,4],[38,4,38,5],[37,2,37,3],[36,4,36,5],[31,2,31,3],[32,2,32,3],[33,2,33,3],[34,2,34,3],[35,2,35,3],[36,2,36,3],[31,4,31,5],[32,4,32,5],[33,4,33,5],[34,4,34,5],[35,4,35,5]]}
[null,"OBLIGATORIO COMPLETAR FORMULARIO"]
[]
[null,"PROGRAMA DE EFICIENCIA ENERGÉTICA v2020"]
[null,"Principales materias primas o insumos (*)",null,null,null,{"$f":"H4","v":0},null,{"$f":"SUM(H7:H32)","v":0}]
[null,"Detalle",null,"Unidad ","Consumo en el último año (unidades)"]
[null,null,null,"[t/año], [m2/año], etc."]
{"$rows_left_out":37}
{"sheet":"4-Consumos energéticos","index":5,"n_rows":15,"n_cols":17,"rows_kept":15,"cut":false,"hidden":false,"merged":[[14,1,14,8],[0,1,0,8],[13,3,13,4],[5,3,5,4],[5,2,6,2],[5,1,6,1],[2,1,2,9],[4,1,4,8],[5,5,5,9]]}
[null,"OBLIGATORIO COMPLETAR FORMULARIO"]
[]
[null,"    PROGRAMA DE EFICIENCIA ENERGÉTICA v2020"]
[]
[null,"DATOS ACTUALES DE LA EMPRESA \nInformación relevada por el Gestor y provista por la Empresa (*)",null,null,null,null,null,null,null,{"$f":"SUM(Q8:Q13)","v":0}]
[null,"Fuente Energética","Tipo de usuario y categoría tarifaria","Consumos Energéticos",null,"Costo (incl. Impuestos)"]
{"$rows_left_out":10}
{"sheet":"5-Inventario general","index":6,"n_rows":59,"n_cols":17,"rows_kept":59,"cut":false,"hidden":false,"merged":[[4,1,4,7],[0,1,0,12],[14,1,14,12],[2,1,2,12],[15,1,15,12],[8,5,8,6],[9,5,9,6],[10,5,10,6],[58,1,58,12],[7,1,7,2],[8,1,8,2],[9,1,9,2],[10,1,10,2],[11,1,11,2],[4,10,12,12],[12,1,12,2],[5,3,5,4],[5,8,6,8],[5,1,6,2],[11,5,11,6],[12,5,12,6],[5,5,5,7],[6,5,6,6],[7,5,7,6]]}
[null,"OBLIGATORIO COMPLETAR FORMULARIO"]
[]
[null,"PROGRAMA DE EFICIENCIA ENERGÉTICA v2020"]
[]
[null,"Resumen Relevamiento",null,null,null,null,null,null,{"$f":"SUM(P8:P13)","v":0},null,"Finalizada la carga del inventario, presione el botón debajo para generar la hoja siguiente."]
[null,"Fuente Energética",null,"Consumos Energéticos Reales",null,"Sumatoria Relevamiento",null,null,"Porcentaje"]
{"$rows_left_out":54}
{"sheet":"6-DdC","index":7,"n_rows":49,"n_cols":12,"rows_kept":49,"cut":false,"hidden":true,"merged":[[6,5,6,7],[12,5,12,7],[13,5,13,7],[0,1,0,8],[2,1,2,8],[3,1,3,8],[5,5,5,7],[40,5,40,7],[41,5,41,7],[47,1,47,8],[48,1,48,8],[4,1,4,8],[11,1,11,8],[18,1,18,8],[25,1,25,8],[32,1,32,8],[39,1,39,8],[33,5,33,7],[34,5,34,7],[19,5,19,7],[20,5,20,7],[26,5,26,7],[27,5,27,7]]}
[null,"PLANILLA AUTOMÁTICA"]
[]
[null,"PROGRAMA DE EFICIENCIA ENERGÉTICA v2020",null,null,null,null,null,null,null,null,null,1]
[null,"Relevamiento de Consumos Energéticos - Usos por Fuente (*)"]
[null,"Energía Eléctrica"]
[null,"Consumo del año base",{"$f":"VLOOKUP(B5,'4-Consumos energéticos'!$B$8:$F$13,5,FALSE)","v":0},{"$f":"VLOOKUP(B5,'4-Consumos energéticos'!$B$8:$D$13,3,FALSE)","v":0},{"$f":"VLOOKUP(B5,'4-Consumos energéticos'!$B$8:$E$13,4,FALSE)","v":"kWh"},{"$f":"\"% cargado del consumo Facturado a la empresa en \"&E6&\" (*2)\"","v":"% cargado del consumo Facturado a la empresa en kWh (*2)"},null,null,{"$f":"IF(OR(D6=0,D6=\"\"),0,SUM(C9:C11)/D6)","v":0}]
{"$rows_left_out":44}
{"sheet":"7-Mejoras de EE","index":8,"n_rows":58,"n_cols":16,"rows_kept":58,"cut":false,"hidden":false,"merged":[[48,1,48,2],[48,3,48,4],[48,5,48,6],[49,1,49,2],[42,4,42,7],[53,1,57,1],[53,2,53,3],[53,5,53,7],[54,2,54,3],[54,5,54,7],[55,2,55,3],[55,5,55,7],[56,2,56,3],[56,5,56,7],[57,2,57,3],[57,5,57,7],[50,1,50,7],[51,1,52,1],[51,2,51,3],[51,5,51,6],[52,2,52,3],[52,5,52,6],[49,3,49,4],[49,5,49,6],[41,1,41,7],[43,1,43,2],[43,3,43,5],[44,2,44,7],[45,1,45,7],[46,1,46,2],[46,3,46,4],[46,5,46,6],[47,1,47,7],[23,1,23,7],[25,1,25,2],[25,3,25,5],[26,2,26,7],[27,1,27,7],[28,1,28,2],[28,3,28,4],[28,5,28,6],[31,1,31,2],[24,4,24,7],[3,1,3,7],[21,1,21,7],[0,1,0,7],[14,2,14,3],[15,2,15,3],[14,5,14,6],[15,5,15,6],[2,1,2,7],[4,1,4,7],[6,1,6,2],[5,4,5,7],[13,1,13,7],[16,5,16,7],[7,2,7,7],[14,1,15,1],[16,2,16,3],[6,3,6,5],[16,1,20,1],[19,2,19,3],[19,5,19,7],[20,2,20,3],[20,5,20,7],[8,1,8,7],[9,1,9,2],[9,3,9,4],[9,5,9,6],[10,1,10,7],[11,1,11,2],[17,2,17,3],[17,5,17,7],[18,2,18,3],[18,5,18,7],[11,3,11,4],[11,5,11,6],[12,1,12,2],[12,3,12,4],[12,5,12,6],[40,1,40,7],[35,2,35,3],[36,2,36,3],[34,2,34,3],[34,5,34,6],[33,5,33,6],[29,1,29,7],[30,1,30,2],[30,3,30,4],[30,5,30,6],[32,1,32,7],[33,1,34,1],[33,2,33,3],[37,2,37,3],[37,5,37,7],[38,2,38,3],[38,5,38,7],[39,2,39,3],[39,5,39,7],[35,1,39,1],[35,5,35,7],[36,5,36,7],[31,3,31,4],[31,5,31,6]]}
[null,"OBLIGATORIO COMPLETAR FORMULARIO"]
[]
[null," Presionar para adicionar una nueva Mejora de Eficiencia Energética --------------->\n En el caso que inserte una mejora y no la vaya a utlizar, déjela en blanco, no la elimine. "]
[null,"PROGRAMA DE EFICIENCIA ENERGÉTICA v2020"]
[null,"Propuesta de Mejora en Eficiencia Energética",null,null,null,null,null,null,null,null,null,null,"horizonte [años]","Ahorro [USD/año]","Año ","Flujos"]
[null,"MEE Nº",1,"Nombre MEE:",null,null,null,null,null,null,null,null,null,null,0,{"$f":"-D13","v":0}]
{"$rows_left_out":53}
{"sheet":"7B-Sugerencias de EE","index":9,"n_rows":28,"n_cols":8,"rows_kept":28,"cut":false,"hidden":false,"merged":[[0,1,0,7],[6,3,6,7],[10,1,10,5],[10,6,10,7],[5,3,5,4],[5,5,5,7],[7,1,7,2],[7,3,7,4],[7,5,7,6],[2,1,2,7],[3,1,3,7],[11,1,11,7],[9,1,9,4],[4,1,4,7],[6,1,6,2],[8,2,8,7],[16,3,16,4],[16,5,16,6],[17,2,17,7],[18,1,18,4],[13,1,13,7],[14,3,14,4],[14,5,14,7],[15,1,15,2],[15,3,15,7],[16,1,16,2],[25,2,25,7],[26,1,26,4],[27,1,27,5],[27,6,27,7],[23,1,23,2],[23,3,23,7],[24,1,24,2],[24,3,24,4],[24,5,24,6],[19,1,19,5],[19,6,19,7],[21,1,21,7],[22,3,22,4],[22,5,22,7]]}
[null,"OBLIGATORIO COMPLETAR FORMULARIO"]
[]
[null,"Presionar para adicionar una nueva Sugerencia de Eficiencia Energética --------------->\nEn el caso que inserte una sugerencia y no la vaya a utlizar, déjela en blanco, no la elimine. "]
[null,"PROGRAMA DE EFICIENCIA ENERGÉTICA v2020"]
[null,"Sugerencia de Mejora para incrementar la Eficiencia Energética (*)"]
[null,"Sugerencia Nº",{"$f":"1","v":1},"Nombre de la sugerencia:"]
{"$rows_left_out":23}
{"sheet":"8-Resumen Ejecutivo","index":10,"n_rows":36,"n_cols":15,"rows_kept":36,"cut":false,"hidden":false,"merged":[[2,1,2,12],[29,1,29,2],[8,7,9,7],[8,8,9,8],[8,2,9,2],[8,1,9,1],[8,3,9,3],[21,3,22,3],[28,3,28,4],[8,12,9,12],[4,10,4,12],[5,10,5,12],[4,6,4,8],[5,6,5,8],[28,1,28,2],[28,10,28,11],[29,10,29,11],[30,10,30,11],[31,10,31,11],[3,1,3,12],[8,5,8,6],[7,1,7,12],[8,4,9,4],[21,4,21,5],[20,1,20,8],[21,2,22,2],[21,8,22,8],[21,6,21,7],[0,1,0,12],[32,10,32,11],[33,10,33,11],[34,10,34,11],[35,10,35,11],[35,1,35,4],[32,1,32,2],[34,1,34,2],[33,1,33,2],[8,9,9,9],[8,10,9,10],[8,11,9,11],[30,1,30,2],[31,1,31,2],[4,1,4,2],[5,1,5,2]]}
[null,"PLANILLA AUTOMÁTICA"]
[]
[null,"    PROGRAMA DE EFICIENCIA ENERGÉTICA v2020"]
[null,"Resumen Ejecutivo de Mejoras de Eficiencia Energética y Sugerencias"]
[null,"Nombre de la empresa",null,"Provincia","Departamento","Categoría o tamaño","Rubro",null,null,"Código de Actividad","Gestor Energético"]
[null,{"$f":"'1-Datos Empresa'!$D$5","v":0},null,{"$f":"'1-Datos Empresa'!$D$12","v":0},{"$f":"'1-Datos Empresa'!$D$13","v":0},{"$f":"'1-Datos Empresa'!$D$6","v":0},{"$f":"'1-Datos Empresa'!$D$9","v":0},null,null,{"$f":"'1-Datos Empresa'!$D$10","v":""},{"$f":"'2-Datos Gestor y Diagnóstico'!$C$8&\", \"&'2-Datos Gestor y Diagnóstico'!$C$7","v":", "}]
{"$rows_left_out":31}
{"sheet":">> Planillas de Relevamiento ->","index":11,"n_rows":2,"n_cols":2,"rows_kept":2,"cut":false,"hidden":false,"merged":[]}
[]
[null,"PROGRAMA DE EFICIENCIA ENERGÉTICA v2020"]

{"sheet":"A-Fact Elec","index":12,"n_rows":19,"n_cols":12,"rows_kept":19,"cut":false,"hidden":false,"merged":[[1,1,1,11],[2,1,2,11],[3,2,3,11],[4,2,4,11],[5,1,6,1]]}
[]
[null,"   PROGRAMA DE EFICIENCIA ENERGÉTICA"]
[null,"Facturas de Energía Eléctrica"]
[null,"Distribuidora"]
[null,"Categoría Tarifaria"]
[null,"Periodo (últimos 12 meses)","Potencia Demandada Punta","Potencia Demandada Fuera de Punta","Potencia Contratada Punta","Potencia Contratada Fuera de Punta","Energía Pico","Energía Resto","Energía Valle","Energía Total Demandada","Costo Total","Factor de Potencia"]
{"$rows_left_out":14}
{"sheet":"A-Fact Gas","index":13,"n_rows":19,"n_cols":4,"rows_kept":19,"cut":false,"hidden":false,"merged":[[1,1,1,3],[2,1,2,3],[3,2,3,3],[4,2,4,3],[5,1,6,1]]}
[]
[null,"   PROGRAMA DE EFICIENCIA ENERGÉTICA"]
[null,"Factura de Gas Narural"]
[null,"Distribuidora"]
[null,"Categoría Tarifaria"]
[null,"Periodo (últimos 12 meses)","Consumo","Costo Total"]
{"$rows_left_out":14}
{"sheet":"A-Fact Otros Comb","index":14,"n_rows":19,"n_cols":8,"rows_kept":19,"cut":false,"hidden":false,"merged":[[1,1,1,7],[2,1,2,7],[3,2,3,7],[4,2,4,7],[5,1,6,1],[5,2,5,3],[5,4,5,5],[5,6,5,7]]}
[]
[null,"   PROGRAMA DE EFICIENCIA ENERGÉTICA"]
[null,"Factura de Otros Combustibles"]
[null,"Distribuidora"]
[null,"Categoría Tarifaria"]
[null,"Periodo (últimos 12 meses)","Comubustible 1",null,"Comubustible 2",null,"Comubustible 3"]
{"$rows_left_out":14}
{"sheet":"B-Invent Motores","index":15,"n_rows":24,"n_cols":13,"rows_kept":24,"cut":false,"hidden":false,"merged":[[1,1,1,10],[2,1,2,10],[3,2,4,2],[3,3,4,3],[3,8,4,8]]}
[]
[null,"   PROGRAMA DE EFICIENCIA ENERGÉTICA"]
[null,"Motores"]
[null,"Potencia Nominal (*)","Antigüedad","Rebobinado [cantidad de veces]","Rendimiento ","Factor de carga","Horas de uso","Variador de velocidad ","Uso","Cantidad","Consumo de Energía"]
[null,"[kW]",null,null,"[%]","[%]","[h/año]","[Si/no]",null,"[Unidades]","[kWh]"]
[null,null,null,null,null,null,null,null,null,null,null,null,"Feyera"]
{"$rows_left_out":19}
{"sheet":"B-Invent Bbas y ventiladores","index":16,"n_rows":25,"n_cols":15,"rows_kept":25,"cut":false,"hidden":false,"merged":[[1,1,1,12],[2,1,2,12],[3,2,4,2],[3,3,4,3],[3,4,4,4],[3,8,3,9],[3,10,4,10]]}
[]
[null,"   PROGRAMA DE EFICIENCIA ENERGÉTICA"]
[null,"Bombas /Ventiladores"]
[null,"Potencia Nominal (*)","Antigüedad","Caudal [m3/h]","Altura de Presíón [mca]","Rendimiento ","Factor de carga","Horas de uso","Sistema de Regulación",null,"Uso","Cantidad","Consumo de Energía"]
[null,"[kW]",null,null,null,"[%]","[%]","[h/año]","Válvula o Damper","Variador de velocidad ",null,"[Unidades]","[kWh]"]
[null,null,null,null,null,null,null,null,null,null,null,null,null,null,"Feyera"]
{"$rows_left_out":20}
{"sheet":"B-Invent Iluminación","index":17,"n_rows":11,"n_cols":8,"rows_kept":11,"cut":false,"hidden":false,"merged":[[1,1,1,7],[2,1,2,7]]}
[]
[null,"   PROGRAMA DE EFICIENCIA ENERGÉTICA"]
[null,"Iluminación"]
[null,"Tipo de lámpara","Potencia [W]","Cantidad [unidades]","Horas de uso [h/año]","Sistemas de control","Area de ubicación","Uso de Luz natural [SI/NO/Oportunidad]"]
[null,"Incandescente",null,null,null,"Interruptor"]
[null,"Halógena",null,null,null,"Temporizador"]
{"$rows_left_out":6}
{"sheet":"B-Equipos de Oficina","index":18,"n_rows":6,"n_cols":9,"rows_kept":6,"cut":false,"hidden":false,"merged":[[1,1,1,6],[2,1,2,6],[3,1,4,1],[3,2,4,2],[3,3,4,3]]}
[]
[null,"   PROGRAMA DE EFICIENCIA ENERGÉTICA"]
[null,"Equipos de oficina"]
[null,"Area","Equipo ","Potencia [kW]","Horas de uso","Cantidad","Consumo de Energía"]
[null,null,null,null,"[h/año]","[Unidades]","[kWh]"]
[null,null,null,null,null,null,null,null,"Feyera"]
{"$rows_left_out":1}
{"sheet":"B-Aire acondicionado","index":19,"n_rows":5,"n_cols":13,"rows_kept":5,"cut":false,"hidden":false,"merged":[[3,11,3,12],[1,1,1,12],[2,1,2,12],[3,1,4,1],[3,2,4,2],[3,3,4,3],[3,4,4,4],[3,5,4,5],[3,6,4,6],[3,7,4,7],[3,8,4,8],[3,9,4,9],[3,10,4,10]]}
[]
[null,"   PROGRAMA DE EFICIENCIA ENERGÉTICA"]
[null,"Aire acondicionado"]
[null,"Marca","Modelo","Antigüedad","Tipo","Potencia de refrigeración [kW]","Potencia de Calefacción [kW]","Potencia [kW]","COP [°/1]","Horas de uso [h/año]","Sistema de control [manual/auto]","Temperarutra de Seteo [°C]"]
[null,null,null,null,null,null,null,null,null,null,null,"Invierno ","Verano"]

{"sheet":"B-Invent Aire Comprimido","index":20,"n_rows":7,"n_cols":11,"rows_kept":7,"cut":false,"hidden":false,"merged":[[1,1,1,10],[2,1,2,10]]}
[]
[null,"   PROGRAMA DE EFICIENCIA ENERGÉTICA"]
[null,"Aire comprimido"]
[null,"Marca","Modelo","Antigüedad","Tipo","Capacidad [m3/min]","Presión de trabajo [kg/cm2]","Potencia [kW]","Horas de uso [h/año]","Tipo de operación","Uso (proceso, servicios, instrumentos)"]
[null,null,null,null,"Centrífugo",null,null,null,null,"Variador de velocidad"]
[null,null,null,null,"Tornillo",null,null,null,null,"Modulante"]
{"$rows_left_out":2}
{"sheet":"B-Invent Calderas","index":21,"n_rows":23,"n_cols":8,"rows_kept":23,"cut":false,"hidden":false,"merged":[[1,1,1,7],[2,1,2,7],[3,1,4,2],[3,3,4,3],[3,4,4,4],[3,5,4,5],[3,6,4,6],[3,7,4,7],[5,1,5,2],[19,1,19,2],[20,1,20,2],[21,1,21,2],[22,1,22,2],[12,1,12,2],[13,1,13,2],[14,1,14,2],[15,1,15,2],[16,1,17,1],[18,1,18,2],[6,1,6,2],[7,1,7,2],[8,1,8,2],[9,1,9,2],[10,1,11,2]]}
[]
[null,"   PROGRAMA DE EFICIENCIA ENERGÉTICA"]
[null,"Calderas"]
[null,"Caldera N°",null,"Unidades",1,2,3,4]
[]
[null,"Tipo "]
{"$rows_left_out":18}
{"sheet":"B-Invent Hornos","index":22,"n_rows":19,"n_cols":8,"rows_kept":19,"cut":false,"hidden":false,"merged":[[1,1,1,7],[2,1,2,7],[3,1,4,2],[3,3,4,3],[3,4,4,4],[3,5,4,5],[3,6,4,6],[3,7,4,7],[5,1,5,2],[17,1,17,2],[18,1,18,2],[11,1,11,2],[12,1,12,2],[13,1,13,2],[14,1,14,2],[15,1,15,2],[16,1,16,2],[6,1,6,2],[7,1,7,2],[8,1,8,2],[9,1,9,2],[10,1,10,2]]}
[]
[null,"   PROGRAMA DE EFICIENCIA ENERGÉTICA"]
[null,"Hornos"]
[null,"Horno N°",null,"Unidades",1,2,3,4]
[]
[null,"Tipo "]
{"$rows_left_out":14}
{"sheet":"C-Invent C. Const. Mat","index":23,"n_rows":40,"n_cols":12,"rows_kept":40,"cut":false,"hidden":false,"merged":[[5,1,5,11],[1,1,1,11],[2,2,2,3],[2,7,2,11],[3,1,3,11],[4,1,4,11],[6,1,8,1],[6,2,8,2],[6,3,6,10],[6,11,8,11],[7,3,7,4],[7,5,7,6],[7,7,7,8],[7,9,7,10],[13,1,13,11],[14,1,16,1],[14,2,16,2],[14,3,14,10],[14,11,16,11],[15,3,15,4],[15,5,15,6],[15,7,15,8],[15,9,15,10],[22,1,22,11],[23,1,23,11],[24,1,25,1],[24,2,25,2],[24,3,24,4],[24,11,25,11],[29,1,29,11],[30,1,31,1],[30,2,31,2],[30,3,30,4],[30,5,30,6],[30,11,31,11],[36,1,36,11],[37,1,39,1],[37,2,39,2],[37,3,37,10],[37,11,39,11],[38,3,38,4],[38,5,38,6],[38,7,38,8],[38,9,38,10]]}
[]
[null,"   PROGRAMA DE EFICIENCIA ENERGÉTICA"]
[null,"Localización",null,null,"Zona Bioclimática IRAM 11.603"]
[null,"Características Constructivas de la Envolvente Edilicia"]
[null,"Cubierta*"]
[null,"* Realizar una por cada tipo de cubierta"]
{"$rows_left_out":35}
{"sheet":"C-Invent C. Const. Est. Pasiv","index":24,"n_rows":49,"n_cols":5,"rows_kept":49,"cut":false,"hidden":false,"merged":[[1,1,1,4],[3,1,3,4],[4,1,4,4],[5,1,5,4],[6,1,7,1],[6,2,7,3],[6,4,7,4],[8,1,13,1],[8,2,8,3],[9,2,9,3],[10,2,10,3],[11,2,11,3],[12,2,12,3],[13,2,13,3],[43,1,48,1],[14,1,19,1],[14,2,14,3],[15,2,15,3],[16,2,16,3],[17,2,17,3],[18,2,18,3],[19,2,19,3],[20,1,20,4],[21,1,21,4],[22,1,23,1],[22,2,23,3],[22,4,23,4]]}
[]
[null,"   PROGRAMA DE EFICIENCIA ENERGÉTICA"]
[null,"Localización",null,"Zona Bioclimática IRAM 11.603"]
[null,"Estrategias de acondicionamiento pasivo"]
[null,"Cubierta*"]
[null,"* Realizar una por cada tipo de cubierta"]
{"$rows_left_out":44}
{"sheet":"C-Características del entorno ","index":25,"n_rows":15,"n_cols":5,"rows_kept":15,"cut":false,"hidden":false,"merged":[[8,1,12,2],[13,1,14,2],[1,1,1,4],[3,1,3,4],[4,1,5,2],[4,3,5,3],[4,4,5,4],[6,1,7,2]]}
[]
[null," PROGRAMA DE EFICIENCIA ENERGÉTICA"]
[null,"Localización",null,"Zona Bioclimática IRAM 11.603"]
[null,"Características del entorno del edificio"]
[null,"Tipo de obstáculos",null,"Efecto","Afectan (SI / NO)"]
[]
{"$rows_left_out":10}
{"sheet":"D-Caract Hoteles","index":26,"n_rows":13,"n_cols":5,"rows_kept":13,"cut":false,"hidden":false,"merged":[[1,1,1,4],[2,1,2,4],[3,2,3,4],[11,1,11,2]]}
[]
[null," PROGRAMA DE EFICIENCIA ENERGÉTICA"]
[null,"Características Hotel"]
[null,"Superficie tot [m2]"]
[null,"Tipo","N° Habitaciones","Superficie media [m2]","Servicios"]
[null,null,null,null,"Calefacción"]
{"$rows_left_out":7}